Reaction Details
TargetSodium-dependent dopamine transporter
LigandBDBM50337823
Substrate/Competitorn/a
Meas. Tech.ChEMBL_726928 (CHEMBL1686717)
IC50 2±n/a nM
Citation Shao, LHewitt, MCWang, FMalcolm, SCMa, JCampbell, JECampbell, UCEngel, SRSpicer, NAHardy, LWSchreiber, RSpear, KLVarney, MA Discovery of N-methyl-1-(1-phenylcyclohexyl)methanamine, a novel triple serotonin, norepinephrine, and dopamine reuptake inhibitor. Bioorg Med Chem Lett21:1438-41 (2011) 
 
Sodium-dependent dopamine transporter
Name:Sodium-dependent dopamine transporter
Type:Multi-pass membrane protein
Mol. Mass.:68497.11
Organism:Homo sapiens (Human)
Description:Q01959
Residue:620
BDBM50337823
NameBDBM50337823
Synonyms:1-((1-(3,4-dichlorophenyl)cyclohexyl)methyl)pyrrolidine US10562878, Compound 111
TypeSmall organic molecule
Emp. Form.C17H23Cl2N
Mol. Mass.312.277
SMILESClc1ccc(cc1Cl)C1(CN2CCCC2)CCCCC1