Reaction Details
TargetSodium-dependent serotonin transporter
LigandBDBM50337829
Substrate/Competitorn/a
Meas. Tech.ChEMBL_726926 (CHEMBL1686715)
IC50 19±n/a nM
Citation Shao, LHewitt, MCWang, FMalcolm, SCMa, JCampbell, JECampbell, UCEngel, SRSpicer, NAHardy, LWSchreiber, RSpear, KLVarney, MA Discovery of N-methyl-1-(1-phenylcyclohexyl)methanamine, a novel triple serotonin, norepinephrine, and dopamine reuptake inhibitor. Bioorg Med Chem Lett21:1438-41 (2011) 
 
Sodium-dependent serotonin transporter
Name:Sodium-dependent serotonin transporter
Type:Multi-pass membrane protein
Mol. Mass.:70322.51
Organism:Homo sapiens (Human)
Description:P31645
Residue:630
BDBM50337829
NameBDBM50337829
Synonyms:1-(1-(3,4-dichlorophenyl)cyclohexyl)-N,N-dimethylmethanamine US10562878, Compound 74
TypeSmall organic molecule
Emp. Form.C15H21Cl2N
Mol. Mass.286.24
SMILESCN(C)CC1(CCCCC1)c1ccc(Cl)c(Cl)c1