Reaction Details
TargetSodium-dependent noradrenaline transporter
LigandBDBM50337834
Substrate/Competitorn/a
Meas. Tech.ChEMBL_726927 (CHEMBL1686716)
IC50 19±n/a nM
Citation Shao, LHewitt, MCWang, FMalcolm, SCMa, JCampbell, JECampbell, UCEngel, SRSpicer, NAHardy, LWSchreiber, RSpear, KLVarney, MA Discovery of N-methyl-1-(1-phenylcyclohexyl)methanamine, a novel triple serotonin, norepinephrine, and dopamine reuptake inhibitor. Bioorg Med Chem Lett21:1438-41 (2011) 
 
Sodium-dependent noradrenaline transporter
Name:Sodium-dependent noradrenaline transporter
Type:Multi-pass membrane protein
Mol. Mass.:69337.72
Organism:Homo sapiens (Human)
Description:P23975
Residue:617
BDBM50337834
NameBDBM50337834
Synonyms:CHEMBL1683872 US10562878, Compound 77
TypeSmall organic molecule
Emp. Form.C15H21Cl2N
Mol. Mass.286.24
SMILESCCNCC1(CCCCC1)c1ccc(Cl)c(Cl)c1