Reaction Details
TargetMuscarinic acetylcholine receptor M3
LigandBDBM50337878
Substrate/Competitorn/a
Meas. Tech.ChEMBL_726947 (CHEMBL1686736)
Ki 0.01±n/a nM
Citation Hughes, ADChin, KHDunham, SLJasper, JRKing, KELee, TWMammen, MMartin, JSteinfeld, T Discovery of muscarinic acetylcholine receptor antagonist and beta 2 adrenoceptor agonist (MABA) dual pharmacology molecules. Bioorg Med Chem Lett21:1354-8 (2011) 
 
Muscarinic acetylcholine receptor M3
Name:Muscarinic acetylcholine receptor M3
Type:Enzyme
Mol. Mass.:66151.03
Organism:Homo sapiens (Human)
Description:P20309
Residue:590
BDBM50337878
NameBDBM50337878
Synonyms:(R)-1-(9-(2-hydroxy-2-(8-hydroxy-2-oxo-1,2-dihydroquinolin-5-yl)ethylamino)nonyl)piperidin-4-yl biphenyl-2-ylcarbamate | CHEMBL1683934
TypeSmall organic molecule
Emp. Form.C38H48N4O5
Mol. Mass.640.8115
SMILESO[C@@H](CNCCCCCCCCCN1CCC(CC1)OC(=O)Nc1ccccc1-c1ccccc1)c1ccc(O)c2[nH]c(=O)ccc12