Reaction Details
TargetSodium-dependent noradrenaline transporter
LigandBDBM50337911
Substrate/Competitorn/a
Meas. Tech.ChEMBL_726960 (CHEMBL1686749)
IC50 7.00±n/a nM
Citation Shao, LHewitt, MCWang, FMalcolm, SCMa, JCampbell, JECampbell, UCEngel, SRSpicer, NAHardy, LWSchreiber, RSpear, KLVarney, MA Discovery of N-methyl-1-(1-phenylcyclohexyl)ethanamine, a novel triple serotonin, norepinephrine and dopamine reuptake inhibitor. Bioorg Med Chem Lett21:1434-7 (2011) 
 
Sodium-dependent noradrenaline transporter
Name:Sodium-dependent noradrenaline transporter
Type:Multi-pass membrane protein
Mol. Mass.:69337.72
Organism:Homo sapiens (Human)
Description:P23975
Residue:617
BDBM50337911
NameBDBM50337911
Synonyms:(+/-)-1-(1-(3,4-dichlorophenyl)cyclohexyl)-N,N-dimethylethanamine CHEMBL1684047 US10562878, Compound 43
TypeSmall organic molecule
Emp. Form.C16H23Cl2N
Mol. Mass.300.267
SMILESCC(N(C)C)C1(CCCCC1)c1ccc(Cl)c(Cl)c1