Reaction Details
TargetDual specificity mitogen-activated protein kinase kinase 1
LigandBDBM50337926
Substrate/Competitorn/a
Meas. Tech.ChEMBL_726976 (CHEMBL1686836)
IC50 3.2±n/a nM
Citation Dong, QDougan, DRGong, XHalkowycz, PJin, BKanouni, TO'Connell, SMScorah, NShi, LWallace, MBZhou, F Discovery of TAK-733, a potent and selective MEK allosteric site inhibitor for the treatment of cancer. Bioorg Med Chem Lett21:1315-9 (2011) 
 
Dual specificity mitogen-activated protein kinase kinase 1
Name:Dual specificity mitogen-activated protein kinase kinase 1
Type:Other Protein Type
Mol. Mass.:43439.03
Organism:Homo sapiens (Human)
Description:Full-length human MEK-1 was generated by PCR and purified as a fusion protein from Escherichia coli lysates.
Residue:393
BDBM50337926
NameBDBM50337926
Synonyms:(R)-3-(2,3-dihydroxypropyl)-6-fluoro-5-(2-fluoro-4-iodophenylamino)-8-methylpyrido[2,3-d]pyrimidine-4,7(3H,8H)-dione CHEMBL1615025 | US8470837, 18
TypeSmall organic molecule
Emp. Form.C17H15F2IN4O4
Mol. Mass.504.2267
SMILESCn1c2ncn(C[C@@H](O)CO)c(=O)c2c(Nc2ccc(I)cc2F)c(F)c1=O