Reaction Details
TargetTransient receptor potential cation channel subfamily V member 1
LigandBDBM50337988
Substrate/Competitorn/a
Meas. Tech.ChEMBL_727155 (CHEMBL1687126)
IC50 6±n/a nM
Citation Schmidt, RGBayburt, EKLatshaw, SPKoenig, JRDaanen, JFMcDonald, HABianchi, BRZhong, CJoshi, SHonore, PMarsh, KCLee, CHFaltynek, CRGomtsyan, A Chroman and tetrahydroquinoline ureas as potent TRPV1 antagonists. Bioorg Med Chem Lett21:1338-41 (2011) 
 
Transient receptor potential cation channel subfamily V member 1
Name:Transient receptor potential cation channel subfamily V member 1
Type:Protein
Mol. Mass.:94960.75
Organism:Homo sapiens (Human)
Description:Q8NER1
Residue:839
BDBM50337988
NameBDBM50337988
Synonyms:1-(8-tert-butyl-1-methyl-1,2,3,4-tetrahydroquinolin-4-yl)-3-(1H-indazol-4-yl)urea | CHEMBL1684262
TypeSmall organic molecule
Emp. Form.C22H27N5O
Mol. Mass.377.4827
SMILESCN1CCC(NC(=O)Nc2cccc3[nH]ncc23)c2cccc(c12)C(C)(C)C