Reaction Details
TargetLysosomal Pro-X carboxypeptidase
LigandBDBM50338032
Substrate/Competitorn/a
Meas. Tech.ChEMBL_727162 (CHEMBL1687133)
IC50 3.7±n/a nM
Citation Shen, HCDing, FXZhou, CXiong, YVerras, AChabin, RMXu, STong, XXie, DLassman, MEBhatt, URGarcia-Calvo, MMGeissler, WShen, ZChen, DSinharoy, RHale, JJTata, JRPinto, SShen, DMColletti, SL Discovery of benzimidazole pyrrolidinyl amides as prolylcarboxypeptidase inhibitors. Bioorg Med Chem Lett21:1299-305 (2011) 
 
Lysosomal Pro-X carboxypeptidase
Name:Lysosomal Pro-X carboxypeptidase
Type:Enzyme
Mol. Mass.:55805.19
Organism:Homo sapiens (Human)
Description:P42785
Residue:496
BDBM50338032
NameBDBM50338032
Synonyms:(S)-1-(2-(5,6-dichloro-1H-benzo[d]imidazol-2-yl)pyrrolidin-1-yl)-3-(4-(3-(quinolin-2-yl)-1,2,4-oxadiazol-5-yl)piperidin-1-yl)propan-1-one | CHEMBL1684300
TypeSmall organic molecule
Emp. Form.C30H29Cl2N7O2
Mol. Mass.590.503
SMILESClc1cc2nc([nH]c2cc1Cl)[C@@H]1CCCN1C(=O)CCN1CCC(CC1)c1nc(no1)-c1ccc2ccccc2n1