Reaction Details
TargetLysosomal Pro-X carboxypeptidase
LigandBDBM50338027
Substrate/Competitorn/a
Meas. Tech.ChEMBL_727163 (CHEMBL1687134)
IC50 3.5±n/a nM
Citation Shen, HCDing, FXZhou, CXiong, YVerras, AChabin, RMXu, STong, XXie, DLassman, MEBhatt, URGarcia-Calvo, MMGeissler, WShen, ZChen, DSinharoy, RHale, JJTata, JRPinto, SShen, DMColletti, SL Discovery of benzimidazole pyrrolidinyl amides as prolylcarboxypeptidase inhibitors. Bioorg Med Chem Lett21:1299-305 (2011) 
 
Lysosomal Pro-X carboxypeptidase
Name:Lysosomal Pro-X carboxypeptidase
Type:PROTEIN
Mol. Mass.:55028.96
Organism:Mus musculus
Description:ChEMBL_1335505
Residue:491
BDBM50338027
NameBDBM50338027
Synonyms:(S)-1-(2-(5,6-dichloro-1H-benzo[d]imidazol-2-yl)pyrrolidin-1-yl)-3-(4-(3-(pyridin-2-yl)-1,2,4-oxadiazol-5-yl)piperidin-1-yl)propan-1-one | CHEMBL1684295
TypeSmall organic molecule
Emp. Form.C26H27Cl2N7O2
Mol. Mass.540.444
SMILESClc1cc2nc([nH]c2cc1Cl)[C@@H]1CCCN1C(=O)CCN1CCC(CC1)c1nc(no1)-c1ccccn1