Reaction Details
TargetLysosomal Pro-X carboxypeptidase
LigandBDBM50338033
Substrate/Competitorn/a
Meas. Tech.ChEMBL_727163 (CHEMBL1687134)
IC50 0.41±n/a nM
Citation Shen, HCDing, FXZhou, CXiong, YVerras, AChabin, RMXu, STong, XXie, DLassman, MEBhatt, URGarcia-Calvo, MMGeissler, WShen, ZChen, DSinharoy, RHale, JJTata, JRPinto, SShen, DMColletti, SL Discovery of benzimidazole pyrrolidinyl amides as prolylcarboxypeptidase inhibitors. Bioorg Med Chem Lett21:1299-305 (2011) 
 
Lysosomal Pro-X carboxypeptidase
Name:Lysosomal Pro-X carboxypeptidase
Type:PROTEIN
Mol. Mass.:55028.96
Organism:Mus musculus
Description:ChEMBL_1335505
Residue:491
BDBM50338033
NameBDBM50338033
Synonyms:(S)-1-(2-(5,6-dichloro-1H-benzo[d]imidazol-2-yl)pyrrolidin-1-yl)-3-(4-(3-(4-(methylsulfonyl)phenyl)-1,2,4-oxadiazol-5-yl)piperidin-1-yl)propan-1-one | CHEMBL1684301
TypeSmall organic molecule
Emp. Form.C28H30Cl2N6O4S
Mol. Mass.617.547
SMILESCS(=O)(=O)c1ccc(cc1)-c1noc(n1)C1CCN(CCC(=O)N2CCC[C@H]2c2nc3cc(Cl)c(Cl)cc3[nH]2)CC1