Reaction Details
TargetTyrosine-protein kinase ITK/TSK
LigandBDBM50338046
Substrate/Competitorn/a
Meas. Tech.ChEMBL_727521 (CHEMBL1685631)
IC50 98±n/a nM
Citation Herdemann, MWeber, AJonveaux, JSchwoebel, FStoeck, MHeit, I Optimisation of ITK inhibitors through successive iterative design cycles. Bioorg Med Chem Lett21:1852-6 (2011) 
 
Tyrosine-protein kinase ITK/TSK
Name:Tyrosine-protein kinase ITK/TSK
Type:Protein
Mol. Mass.:71839.20
Organism:Homo sapiens (Human)
Description:Q08881
Residue:620
BDBM50338046
NameBDBM50338046
Synonyms:2-methoxy-N-(3-(6-methoxy-1H-indol-2-yl)-1H-indazol-5-yl)acetamide | CHEMBL1684509
TypeSmall organic molecule
Emp. Form.C19H18N4O3
Mol. Mass.350.3712
SMILESCOCC(=O)Nc1ccc2[nH]nc(-c3cc4ccc(OC)cc4[nH]3)c2c1