Reaction Details
TargetTyrosine-protein kinase ITK/TSK
LigandBDBM50338051
Substrate/Competitorn/a
Meas. Tech.ChEMBL_727521 (CHEMBL1685631)
IC50 47±n/a nM
Citation Herdemann, MWeber, AJonveaux, JSchwoebel, FStoeck, MHeit, I Optimisation of ITK inhibitors through successive iterative design cycles. Bioorg Med Chem Lett21:1852-6 (2011) 
 
Tyrosine-protein kinase ITK/TSK
Name:Tyrosine-protein kinase ITK/TSK
Type:Protein
Mol. Mass.:71839.20
Organism:Homo sapiens (Human)
Description:Q08881
Residue:620
BDBM50338051
NameBDBM50338051
Synonyms:2-fluoro-N-(3-(6-methyl-1H-indol-2-yl)-1H-indazol-5-yl)benzenesulfonamide | CHEMBL1684518
TypeSmall organic molecule
Emp. Form.C22H17FN4O2S
Mol. Mass.420.459
SMILESCc1ccc2cc([nH]c2c1)-c1n[nH]c2ccc(NS(=O)(=O)c3ccccc3F)cc12