Reaction Details
TargetTyrosine-protein kinase ITK/TSK
LigandBDBM50338072
Substrate/Competitorn/a
Meas. Tech.ChEMBL_727521 (CHEMBL1685631)
IC50 200±n/a nM
Citation Herdemann, MWeber, AJonveaux, JSchwoebel, FStoeck, MHeit, I Optimisation of ITK inhibitors through successive iterative design cycles. Bioorg Med Chem Lett21:1852-6 (2011) 
 
Tyrosine-protein kinase ITK/TSK
Name:Tyrosine-protein kinase ITK/TSK
Type:Protein
Mol. Mass.:71839.20
Organism:Homo sapiens (Human)
Description:Q08881
Residue:620
BDBM50338072
NameBDBM50338072
Synonyms:CHEMBL1684674 | N-(cyclohexylmethyl)-2-(1H-indazol-3-yl)-1H-indole-6-carboxamide
TypeSmall organic molecule
Emp. Form.C23H24N4O
Mol. Mass.372.4629
SMILESO=C(NCC1CCCCC1)c1ccc2cc([nH]c2c1)-c1n[nH]c2ccccc12