Reaction Details
TargetTyrosine-protein kinase ITK/TSK
LigandBDBM50338085
Substrate/Competitorn/a
Meas. Tech.ChEMBL_727521 (CHEMBL1685631)
IC50 83±n/a nM
Citation Herdemann, MWeber, AJonveaux, JSchwoebel, FStoeck, MHeit, I Optimisation of ITK inhibitors through successive iterative design cycles. Bioorg Med Chem Lett21:1852-6 (2011) 
 
Tyrosine-protein kinase ITK/TSK
Name:Tyrosine-protein kinase ITK/TSK
Type:Protein
Mol. Mass.:71839.20
Organism:Homo sapiens (Human)
Description:Q08881
Residue:620
BDBM50338085
NameBDBM50338085
Synonyms:1-ethyl-3-(3-(6-methyl-1H-indol-2-yl)-1H-indazol-5-yl)urea | CHEMBL1684528
TypeSmall organic molecule
Emp. Form.C19H19N5O
Mol. Mass.333.3871
SMILESCCNC(=O)Nc1ccc2[nH]nc(-c3cc4ccc(C)cc4[nH]3)c2c1