Reaction Details
TargetTyrosine-protein kinase ITK/TSK
LigandBDBM50338112
Substrate/Competitorn/a
Meas. Tech.ChEMBL_727521 (CHEMBL1685631)
IC50 30±n/a nM
Citation Herdemann, MWeber, AJonveaux, JSchwoebel, FStoeck, MHeit, I Optimisation of ITK inhibitors through successive iterative design cycles. Bioorg Med Chem Lett21:1852-6 (2011) 
 
Tyrosine-protein kinase ITK/TSK
Name:Tyrosine-protein kinase ITK/TSK
Type:Protein
Mol. Mass.:71839.20
Organism:Homo sapiens (Human)
Description:Q08881
Residue:620
BDBM50338112
NameBDBM50338112
Synonyms:CHEMBL1684655 | N-(1-benzylpyrrolidin-3-yl)-3-(6-methyl-1H-indol-2-yl)-1H-indazol-5-amine
TypeSmall organic molecule
Emp. Form.C27H27N5
Mol. Mass.421.5368
SMILESCc1ccc2cc([nH]c2c1)-c1n[nH]c2ccc(NC3CCN(Cc4ccccc4)C3)cc12