Reaction Details
TargetTyrosine-protein kinase ITK/TSK
LigandBDBM50338118
Substrate/Competitorn/a
Meas. Tech.ChEMBL_727521 (CHEMBL1685631)
IC50 130±n/a nM
Citation Herdemann, MWeber, AJonveaux, JSchwoebel, FStoeck, MHeit, I Optimisation of ITK inhibitors through successive iterative design cycles. Bioorg Med Chem Lett21:1852-6 (2011) 
 
Tyrosine-protein kinase ITK/TSK
Name:Tyrosine-protein kinase ITK/TSK
Type:Protein
Mol. Mass.:71839.20
Organism:Homo sapiens (Human)
Description:Q08881
Residue:620
BDBM50338118
NameBDBM50338118
Synonyms:3,5-dimethyl-N-(3-(6-methyl-1H-indol-2-yl)-1H-indazol-5-yl)isoxazole-4-sulfonamide | CHEMBL1684523
TypeSmall organic molecule
Emp. Form.C21H19N5O3S
Mol. Mass.421.472
SMILESCc1noc(C)c1S(=O)(=O)Nc1ccc2[nH]nc(-c3cc4ccc(C)cc4[nH]3)c2c1