Reaction Details
TargetVascular endothelial growth factor receptor 2
LigandBDBM50338213
Substrate/Competitorn/a
Meas. Tech.ChEMBL_727921 (CHEMBL1686633)
IC50 3.4±n/a nM
Citation Huang, SLi, RLaMontagne, KRGreenberger, LMConnolly, PJ 4-aminopyrimidine-5-carbaldehyde oximes as potent VEGFR-2 inhibitors. Part II. Bioorg Med Chem Lett21:1815-8 (2011) 
 
Vascular endothelial growth factor receptor 2
Name:Vascular endothelial growth factor receptor 2
Type:Receptor Tyrosine Kinase
Mol. Mass.:151510.97
Organism:Homo sapiens (Human)
Description:P35968
Residue:1356
BDBM50338213
NameBDBM50338213
Synonyms:1-(4-(6-amino-5-((methoxyimino)methyl)pyrimidin-4-yloxy)-2-chlorophenyl)-3-(thiazol-2-yl)urea | CHEMBL1681943
TypeSmall organic molecule
Emp. Form.C16H14ClN7O3S
Mol. Mass.419.845
SMILESCO\N=C\c1c(N)ncnc1Oc1ccc(NC(=O)Nc2nccs2)c(Cl)c1