Reaction Details
TargetVascular endothelial growth factor receptor 2
LigandBDBM50338215
Substrate/Competitorn/a
Meas. Tech.ChEMBL_727921 (CHEMBL1686633)
IC50 2±n/a nM
Citation Huang, SLi, RLaMontagne, KRGreenberger, LMConnolly, PJ 4-aminopyrimidine-5-carbaldehyde oximes as potent VEGFR-2 inhibitors. Part II. Bioorg Med Chem Lett21:1815-8 (2011) 
 
Vascular endothelial growth factor receptor 2
Name:Vascular endothelial growth factor receptor 2
Type:Receptor Tyrosine Kinase
Mol. Mass.:151510.97
Organism:Homo sapiens (Human)
Description:P35968
Residue:1356
BDBM50338215
NameBDBM50338215
Synonyms:1-(4-(6-amino-5-((methoxyimino)methyl)pyrimidin-4-yloxy)-2-chlorophenyl)-3-(5-methylisoxazol-3-yl)urea | CHEMBL1681945
TypeSmall organic molecule
Emp. Form.C17H16ClN7O4
Mol. Mass.417.806
SMILESCO\N=C\c1c(N)ncnc1Oc1ccc(NC(=O)Nc2cc(C)on2)c(Cl)c1