Reaction Details
TargetVascular endothelial growth factor receptor 2
LigandBDBM50338216
Substrate/Competitorn/a
Meas. Tech.ChEMBL_727921 (CHEMBL1686633)
IC50 3±n/a nM
Citation Huang, SLi, RLaMontagne, KRGreenberger, LMConnolly, PJ 4-aminopyrimidine-5-carbaldehyde oximes as potent VEGFR-2 inhibitors. Part II. Bioorg Med Chem Lett21:1815-8 (2011) 
 
Vascular endothelial growth factor receptor 2
Name:Vascular endothelial growth factor receptor 2
Type:Receptor Tyrosine Kinase
Mol. Mass.:151510.97
Organism:Homo sapiens (Human)
Description:P35968
Residue:1356
BDBM50338216
NameBDBM50338216
Synonyms:1-(4-(6-amino-5-((methoxyimino)methyl)pyrimidin-4-yloxy)-2-chlorophenyl)-3-phenylurea | CHEMBL1681946
TypeSmall organic molecule
Emp. Form.C19H17ClN6O3
Mol. Mass.412.83
SMILESCO\N=C\c1c(N)ncnc1Oc1ccc(NC(=O)Nc2ccccc2)c(Cl)c1