Reaction Details
TargetMitogen-activated protein kinase 9
LigandBDBM50338271
Substrate/Competitorn/a
Meas. Tech.ChEMBL_727961 (CHEMBL1686759)
IC50>50000±n/a nM
Citation Bowers, STruong, APNeitz, RJNeitzel, MProbst, GDHom, RKPeterson, BGalemmo, RAKonradi, AWSham, HLTóth, GPan, HYao, NArtis, DRBrigham, EFQuinn, KPSauer, JMPowell, KRuslim, LRen, ZBard, FYednock, TAGriswold-Prenner, I Design and synthesis of a novel, orally active, brain penetrant, tri-substituted thiophene based JNK inhibitor. Bioorg Med Chem Lett21:1838-43 (2011) 
 
Mitogen-activated protein kinase 9
Name:Mitogen-activated protein kinase 9
Type:Enzyme
Mol. Mass.:48131.49
Organism:Homo sapiens (Human)
Description:JNK-2 was purchased from Upstate Cell Signaling Solutions (formerly Upstate Biotechnology).
Residue:424
BDBM50338271
NameBDBM50338271
Synonyms:CHEMBL1681995 | ethyl 2-(2-(4-methoxyphenyl)acetamido)-4-(trifluoromethyl)thiophene-3-carboxylate
TypeSmall organic molecule
Emp. Form.C17H16F3NO4S
Mol. Mass.387.373
SMILESCCOC(=O)c1c(NC(=O)Cc2ccc(OC)cc2)scc1C(F)(F)F