Reaction Details
TargetMitogen-activated protein kinase 9
LigandBDBM50338272
Substrate/Competitorn/a
Meas. Tech.ChEMBL_727961 (CHEMBL1686759)
IC50 930±n/a nM
Citation Bowers, STruong, APNeitz, RJNeitzel, MProbst, GDHom, RKPeterson, BGalemmo, RAKonradi, AWSham, HLTóth, GPan, HYao, NArtis, DRBrigham, EFQuinn, KPSauer, JMPowell, KRuslim, LRen, ZBard, FYednock, TAGriswold-Prenner, I Design and synthesis of a novel, orally active, brain penetrant, tri-substituted thiophene based JNK inhibitor. Bioorg Med Chem Lett21:1838-43 (2011) 
 
Mitogen-activated protein kinase 9
Name:Mitogen-activated protein kinase 9
Type:Enzyme
Mol. Mass.:48131.49
Organism:Homo sapiens (Human)
Description:JNK-2 was purchased from Upstate Cell Signaling Solutions (formerly Upstate Biotechnology).
Residue:424
BDBM50338272
NameBDBM50338272
Synonyms:CHEMBL1681996 | ethyl 4-cyano-2-(2-(4-methoxyphenyl)acetamido)thiophene-3-carboxylate
TypeSmall organic molecule
Emp. Form.C17H16N2O4S
Mol. Mass.344.385
SMILESCCOC(=O)c1c(NC(=O)Cc2ccc(OC)cc2)scc1C#N