Reaction Details
TargetMitogen-activated protein kinase 9
LigandBDBM50338280
Substrate/Competitorn/a
Meas. Tech.ChEMBL_727961 (CHEMBL1686759)
IC50 409±n/a nM
Citation Bowers, STruong, APNeitz, RJNeitzel, MProbst, GDHom, RKPeterson, BGalemmo, RAKonradi, AWSham, HLTóth, GPan, HYao, NArtis, DRBrigham, EFQuinn, KPSauer, JMPowell, KRuslim, LRen, ZBard, FYednock, TAGriswold-Prenner, I Design and synthesis of a novel, orally active, brain penetrant, tri-substituted thiophene based JNK inhibitor. Bioorg Med Chem Lett21:1838-43 (2011) 
 
Mitogen-activated protein kinase 9
Name:Mitogen-activated protein kinase 9
Type:Enzyme
Mol. Mass.:48131.49
Organism:Homo sapiens (Human)
Description:JNK-2 was purchased from Upstate Cell Signaling Solutions (formerly Upstate Biotechnology).
Residue:424
BDBM50338280
NameBDBM50338280
Synonyms:CHEMBL1682004 | methyl 4-methyl-2-(2-(quinolin-5-yl)acetamido)thiophene-3-carboxylate
TypeSmall organic molecule
Emp. Form.C18H16N2O3S
Mol. Mass.340.396
SMILESCOC(=O)c1c(C)csc1NC(=O)Cc1cccc2ncccc12