Reaction Details
TargetMitogen-activated protein kinase 8
LigandBDBM50338268
Substrate/Competitorn/a
Meas. Tech.ChEMBL_727962 (CHEMBL1686760)
IC50 590±n/a nM
Citation Bowers, STruong, APNeitz, RJNeitzel, MProbst, GDHom, RKPeterson, BGalemmo, RAKonradi, AWSham, HLTóth, GPan, HYao, NArtis, DRBrigham, EFQuinn, KPSauer, JMPowell, KRuslim, LRen, ZBard, FYednock, TAGriswold-Prenner, I Design and synthesis of a novel, orally active, brain penetrant, tri-substituted thiophene based JNK inhibitor. Bioorg Med Chem Lett21:1838-43 (2011) 
 
Mitogen-activated protein kinase 8
Name:Mitogen-activated protein kinase 8
Type:Enzyme
Mol. Mass.:48297.57
Organism:Homo sapiens (Human)
Description:JNK-1 was purchased from Upstate Cell Signaling Solutions (formerly Upstate Biotechnology).
Residue:427
BDBM50338268
NameBDBM50338268
Synonyms:CHEMBL1681992 | methyl 2-(2-(4-methoxyphenyl)acetamido)-4-methylthiophene-3-carboxylate
TypeSmall organic molecule
Emp. Form.C16H17NO4S
Mol. Mass.319.375
SMILESCOC(=O)c1c(C)csc1NC(=O)Cc1ccc(OC)cc1