Reaction Details
TargetMitogen-activated protein kinase 8
LigandBDBM50338274
Substrate/Competitorn/a
Meas. Tech.ChEMBL_727962 (CHEMBL1686760)
IC50 283±n/a nM
Citation Bowers, STruong, APNeitz, RJNeitzel, MProbst, GDHom, RKPeterson, BGalemmo, RAKonradi, AWSham, HLTóth, GPan, HYao, NArtis, DRBrigham, EFQuinn, KPSauer, JMPowell, KRuslim, LRen, ZBard, FYednock, TAGriswold-Prenner, I Design and synthesis of a novel, orally active, brain penetrant, tri-substituted thiophene based JNK inhibitor. Bioorg Med Chem Lett21:1838-43 (2011) 
 
Mitogen-activated protein kinase 8
Name:Mitogen-activated protein kinase 8
Type:Enzyme
Mol. Mass.:48297.57
Organism:Homo sapiens (Human)
Description:JNK-1 was purchased from Upstate Cell Signaling Solutions (formerly Upstate Biotechnology).
Residue:427
BDBM50338274
NameBDBM50338274
Synonyms:CHEMBL1681998 | methyl 4-methyl-2-(2-(4-(pyridin-4-yl)phenyl)acetamido)thiophene-3-carboxylate
TypeSmall organic molecule
Emp. Form.C20H18N2O3S
Mol. Mass.366.434
SMILESCOC(=O)c1c(C)csc1NC(=O)Cc1ccc(cc1)-c1ccncc1