Reaction Details
TargetMitogen-activated protein kinase 14
LigandBDBM50338263
Substrate/Competitorn/a
Meas. Tech.ChEMBL_727963 (CHEMBL1686761)
IC50>50000±n/a nM
Citation Bowers, STruong, APNeitz, RJNeitzel, MProbst, GDHom, RKPeterson, BGalemmo, RAKonradi, AWSham, HLTóth, GPan, HYao, NArtis, DRBrigham, EFQuinn, KPSauer, JMPowell, KRuslim, LRen, ZBard, FYednock, TAGriswold-Prenner, I Design and synthesis of a novel, orally active, brain penetrant, tri-substituted thiophene based JNK inhibitor. Bioorg Med Chem Lett21:1838-43 (2011) 
 
Mitogen-activated protein kinase 14
Name:Mitogen-activated protein kinase 14
Type:Serine/threonine-protein kinase
Mol. Mass.:41286.76
Organism:Homo sapiens (Human)
Description:Q16539
Residue:360
BDBM50338263
NameBDBM50338263
Synonyms:CHEMBL1682017 | N-(4-chloro-3-(1H-1,2,4-triazol-5-yl)thiophen-2-yl)-2-(isoquinolin-5-yl)acetamide
TypeSmall organic molecule
Emp. Form.C17H12ClN5OS
Mol. Mass.369.828
SMILESClc1csc(NC(=O)Cc2cccc3cnccc23)c1-c1nnc[nH]1