Reaction Details
TargetMitogen-activated protein kinase 14
LigandBDBM50338267
Substrate/Competitorn/a
Meas. Tech.ChEMBL_727963 (CHEMBL1686761)
IC50>50000±n/a nM
Citation Bowers, STruong, APNeitz, RJNeitzel, MProbst, GDHom, RKPeterson, BGalemmo, RAKonradi, AWSham, HLTóth, GPan, HYao, NArtis, DRBrigham, EFQuinn, KPSauer, JMPowell, KRuslim, LRen, ZBard, FYednock, TAGriswold-Prenner, I Design and synthesis of a novel, orally active, brain penetrant, tri-substituted thiophene based JNK inhibitor. Bioorg Med Chem Lett21:1838-43 (2011) 
 
Mitogen-activated protein kinase 14
Name:Mitogen-activated protein kinase 14
Type:Serine/threonine-protein kinase
Mol. Mass.:41286.76
Organism:Homo sapiens (Human)
Description:Q16539
Residue:360
BDBM50338267
NameBDBM50338267
Synonyms:CHEMBL1682021 US9796706, Compound 39
TypeSmall organic molecule
Emp. Form.C18H12N6OS
Mol. Mass.360.392
SMILESO=C(Cc1cccc2ncccc12)Nc1scc(C#N)c1-c1nnc[nH]1