Reaction Details
TargetMitogen-activated protein kinase 1
LigandBDBM50332040
Substrate/Competitorn/a
Meas. Tech.ChEMBL_727964 (CHEMBL1686762)
IC50>50000±n/a nM
Citation Bowers, STruong, APNeitz, RJNeitzel, MProbst, GDHom, RKPeterson, BGalemmo, RAKonradi, AWSham, HLTóth, GPan, HYao, NArtis, DRBrigham, EFQuinn, KPSauer, JMPowell, KRuslim, LRen, ZBard, FYednock, TAGriswold-Prenner, I Design and synthesis of a novel, orally active, brain penetrant, tri-substituted thiophene based JNK inhibitor. Bioorg Med Chem Lett21:1838-43 (2011) 
 
Mitogen-activated protein kinase 1
Name:Mitogen-activated protein kinase 1
Type:Ser/Thr Protein Kinase
Mol. Mass.:41392.76
Organism:Homo sapiens (Human)
Description:P28482
Residue:360
BDBM50332040
NameBDBM50332040
Synonyms:CHEMBL1288895 | methyl 3-(2-(thiophen-2-yl)acetamido)thiophene-2-carboxylate
TypeSmall organic molecule
Emp. Form.C12H11NO3S2
Mol. Mass.281.351
SMILESCOC(=O)c1sccc1NC(=O)Cc1cccs1