Reaction Details
TargetMitogen-activated protein kinase 10
LigandBDBM50338269
Substrate/Competitorn/a
Meas. Tech.ChEMBL_727960 (CHEMBL1686758)
IC50 9110±n/a nM
Citation Bowers, STruong, APNeitz, RJNeitzel, MProbst, GDHom, RKPeterson, BGalemmo, RAKonradi, AWSham, HLTóth, GPan, HYao, NArtis, DRBrigham, EFQuinn, KPSauer, JMPowell, KRuslim, LRen, ZBard, FYednock, TAGriswold-Prenner, I Design and synthesis of a novel, orally active, brain penetrant, tri-substituted thiophene based JNK inhibitor. Bioorg Med Chem Lett21:1838-43 (2011) 
 
Mitogen-activated protein kinase 10
Name:Mitogen-activated protein kinase 10
Type:Enzyme
Mol. Mass.:52586.89
Organism:Homo sapiens (Human)
Description:n/a
Residue:464
BDBM50338269
NameBDBM50338269
Synonyms:CHEMBL1681993 | methyl 4-ethyl-2-(2-(4-methoxyphenyl)acetamido)thiophene-3-carboxylate
TypeSmall organic molecule
Emp. Form.C17H19NO4S
Mol. Mass.333.402
SMILESCCc1csc(NC(=O)Cc2ccc(OC)cc2)c1C(=O)OC