Reaction Details
TargetMitogen-activated protein kinase 10
LigandBDBM50338282
Substrate/Competitorn/a
Meas. Tech.ChEMBL_727960 (CHEMBL1686758)
IC50 125±n/a nM
Citation Bowers, STruong, APNeitz, RJNeitzel, MProbst, GDHom, RKPeterson, BGalemmo, RAKonradi, AWSham, HLTóth, GPan, HYao, NArtis, DRBrigham, EFQuinn, KPSauer, JMPowell, KRuslim, LRen, ZBard, FYednock, TAGriswold-Prenner, I Design and synthesis of a novel, orally active, brain penetrant, tri-substituted thiophene based JNK inhibitor. Bioorg Med Chem Lett21:1838-43 (2011) 
 
Mitogen-activated protein kinase 10
Name:Mitogen-activated protein kinase 10
Type:Enzyme
Mol. Mass.:52586.89
Organism:Homo sapiens (Human)
Description:n/a
Residue:464
BDBM50338282
NameBDBM50338282
Synonyms:CHEMBL1682005 | methyl 4-methyl-2-(2-(2-oxo-3,4-dihydroquinolin-1(2H)-yl)acetamido)thiophene-3-carboxylate
TypeSmall organic molecule
Emp. Form.C18H18N2O4S
Mol. Mass.358.412
SMILESCOC(=O)c1c(C)csc1NC(=O)CN1C(=O)CCc2ccccc12