Reaction Details
TargetEnoyl-[acyl-carrier-protein] reductase [NADPH] FabI [9-251]
LigandBDBM50338301
Substrate/Competitorn/a
Meas. Tech.ChEMBL_728028 (CHEMBL1686899)
IC50 15300±n/a nM
Citation Cho, JYKwon, YJSohn, MJSeok, SJKim, WG Phellinstatin, a new inhibitor of enoyl-ACP reductase produced by the medicinal fungus Phellinus linteus. Bioorg Med Chem Lett21:1716-8 (2011) 
 
Enoyl-[acyl-carrier-protein] reductase [NADPH] FabI [9-251]
Name:Enoyl-[acyl-carrier-protein] reductase [NADPH] FabI [9-251]
Type:PROTEIN
Mol. Mass.:26446.66
Organism:Staphylococcus aureus
Description:ChEMBL_1455655
Residue:243
BDBM50338301
NameBDBM50338301
Synonyms:CHEMBL1682260 | hypholomine B
TypeSmall organic molecule
Emp. Form.C26H18O10
Mol. Mass.490.4151
SMILESOc1cc(oc(=O)c1)[C@@H]1[C@H](Oc2cc(\C=C\c3ccc(O)c(O)c3)oc(=O)c12)c1ccc(O)c(O)c1