Reaction Details
TargetGlucocorticoid receptor
LigandBDBM50338325
Substrate/Competitorn/a
Meas. Tech.ChEMBL_728108 (CHEMBL1687050)
Ki 1.8±n/a nM
Citation Hudson, ARHiguchi, RIRoach, SLAdams, MEVassar, ASyka, PMMais, DEMiner, JNMarschke, KBZhi, L Discovery of orally available tetrahydroquinoline-based glucocorticoid receptor agonists. Bioorg Med Chem Lett21:1697-700 (2011) 
 
Glucocorticoid receptor
Name:Glucocorticoid receptor
Type:Enzyme
Mol. Mass.:85656.87
Organism:Homo sapiens (Human)
Description:P04150
Residue:777
BDBM50338325
NameBDBM50338325
Synonyms:(+/-)-(3R,4S)-7-chloro-6-(1H-indol-7-yl)-2,2,4,8-tetramethyl-1,2,3,4-tetrahydroquinolin-3-ol | CHEMBL1682431
TypeSmall organic molecule
Emp. Form.C21H23ClN2O
Mol. Mass.354.873
SMILESC[C@@H]1[C@@H](O)C(C)(C)Nc2c(C)c(Cl)c(cc12)-c1cccc2cc[nH]c12