Reaction Details
TargetGlucocorticoid receptor
LigandBDBM50338315
Substrate/Competitorn/a
Meas. Tech.ChEMBL_728108 (CHEMBL1687050)
Ki 3.5±n/a nM
Citation Hudson, ARHiguchi, RIRoach, SLAdams, MEVassar, ASyka, PMMais, DEMiner, JNMarschke, KBZhi, L Discovery of orally available tetrahydroquinoline-based glucocorticoid receptor agonists. Bioorg Med Chem Lett21:1697-700 (2011) 
 
Glucocorticoid receptor
Name:Glucocorticoid receptor
Type:Enzyme
Mol. Mass.:85656.87
Organism:Homo sapiens (Human)
Description:P04150
Residue:777
BDBM50338315
NameBDBM50338315
Synonyms:(+/-)-3-hydroxy-6-(1H-indol-7-yl)-2,2,4,8-tetramethyl-1,2,3,4-tetrahydroquinoline-5-carbaldehyde O-phenyl oxime | CHEMBL1682426
TypeSmall organic molecule
Emp. Form.C29H31N3O2
Mol. Mass.453.5753
SMILESC[C@@H]1[C@@H](O)C(C)(C)Nc2c(C)cc(c(\C=N\OCc3ccccc3)c12)-c1cccc2cc[nH]c12