Reaction Details
TargetGlucocorticoid receptor
LigandBDBM50338316
Substrate/Competitorn/a
Meas. Tech.ChEMBL_728108 (CHEMBL1687050)
Ki 6±n/a nM
Citation Hudson, ARHiguchi, RIRoach, SLAdams, MEVassar, ASyka, PMMais, DEMiner, JNMarschke, KBZhi, L Discovery of orally available tetrahydroquinoline-based glucocorticoid receptor agonists. Bioorg Med Chem Lett21:1697-700 (2011) 
 
Glucocorticoid receptor
Name:Glucocorticoid receptor
Type:Enzyme
Mol. Mass.:85656.87
Organism:Homo sapiens (Human)
Description:P04150
Residue:777
BDBM50338316
NameBDBM50338316
Synonyms:(+/-)-3-hydroxy-6-(1H-indol-7-yl)-2,2,4,8-tetramethyl-1,2,3,4-tetrahydroquinoline-5-carbaldehyde O-tert-butyl oxime | CHEMBL1682425
TypeSmall organic molecule
Emp. Form.C26H33N3O2
Mol. Mass.419.5591
SMILESC[C@@H]1[C@@H](O)C(C)(C)Nc2c(C)cc(c(\C=N\OC(C)(C)C)c12)-c1cccc2cc[nH]c12