Reaction Details
TargetDipeptidyl peptidase 4
LigandBDBM50338431
Substrate/Competitorn/a
Meas. Tech.ChEMBL_728292 (CHEMBL1687449)
IC50 82±n/a nM
Citation Chen, PCaldwell, CGAshton, WWu, JKHe, HLyons, KAThornberry, NAWeber, AE Synthesis and evaluation of [(1R)-1-amino-2-(2,5-difluorophenyl)ethyl]cyclohexanes and 4-[(1R)-1-amino-2-(2,5-difluorophenyl)ethyl]piperidines as DPP-4 inhibitors. Bioorg Med Chem Lett21:1880-6 (2011) 
 
Dipeptidyl peptidase 4
Name:Dipeptidyl peptidase 4
Type:Enzyme
Mol. Mass.:88271.01
Organism:Homo sapiens (Human)
Description:P27487
Residue:766
BDBM50338431
NameBDBM50338431
Synonyms:(R)-ethyl 5-(4-(1-amino-2-(2,5-difluorophenyl)ethyl)piperidin-1-yl)nicotinate | CHEMBL1683137
TypeSmall organic molecule
Emp. Form.C21H25F2N3O2
Mol. Mass.389.4389
SMILESCCOC(=O)c1cncc(c1)N1CCC(CC1)[C@H](N)Cc1cc(F)ccc1F