Reaction Details
TargetDipeptidyl peptidase 4
LigandBDBM50338458
Substrate/Competitorn/a
Meas. Tech.ChEMBL_728292 (CHEMBL1687449)
IC50 38±n/a nM
Citation Chen, PCaldwell, CGAshton, WWu, JKHe, HLyons, KAThornberry, NAWeber, AE Synthesis and evaluation of [(1R)-1-amino-2-(2,5-difluorophenyl)ethyl]cyclohexanes and 4-[(1R)-1-amino-2-(2,5-difluorophenyl)ethyl]piperidines as DPP-4 inhibitors. Bioorg Med Chem Lett21:1880-6 (2011) 
 
Dipeptidyl peptidase 4
Name:Dipeptidyl peptidase 4
Type:Enzyme
Mol. Mass.:88271.01
Organism:Homo sapiens (Human)
Description:P27487
Residue:766
BDBM50338458
NameBDBM50338458
Synonyms:CHEMBL1683092 | trans-N-(4-((R)-1-amino-2-(2,5-difluorophenyl)ethyl)cyclohexyl)-N-ethyl-3,5-dimethylisoxazole-4-sulfonamide
TypeSmall organic molecule
Emp. Form.C21H29F2N3O3S
Mol. Mass.441.535
SMILESCCN([C@H]1CC[C@@H](CC1)[C@H](N)Cc1cc(F)ccc1F)S(=O)(=O)c1c(C)noc1C