Reaction Details
TargetDipeptidyl peptidase 4
LigandBDBM50338504
Substrate/Competitorn/a
Meas. Tech.ChEMBL_728457 (CHEMBL1685334)
IC50 13±n/a nM
Citation Andrews, KMBeebe, DABenbow, JWBoyer, DADoran, SDHui, YLiu, SMcPherson, RKNeagu, CParker, JCPiotrowski, DWSchneider, SRTreadway, JLVanVolkenberg, MAZembrowski, WJ 1-((3S,4S)-4-amino-1-(4-substituted-1,3,5-triazin-2-yl) pyrrolidin-3-yl)-5,5-difluoropiperidin-2-one inhibitors of DPP-4 for the treatment of type 2 diabetes. Bioorg Med Chem Lett21:1810-4 (2011) 
 
Dipeptidyl peptidase 4
Name:Dipeptidyl peptidase 4
Type:Enzyme
Mol. Mass.:88271.01
Organism:Homo sapiens (Human)
Description:P27487
Residue:766
BDBM50338504
NameBDBM50338504
Synonyms:(3R,4S)-4-phenyl-1-(6-(2,3,5-trifluorophenyl)pyrimidin-4-yl)pyrrolidin-3-amine | CHEMBL1683557
TypeSmall organic molecule
Emp. Form.C20H17F3N4
Mol. Mass.370.371
SMILESN[C@H]1CN(C[C@@H]1c1ccccc1)c1cc(ncn1)-c1cc(F)cc(F)c1F