Reaction Details
TargetDipeptidyl peptidase 4
LigandBDBM50338510
Substrate/Competitorn/a
Meas. Tech.ChEMBL_728457 (CHEMBL1685334)
IC50 19±n/a nM
Citation Andrews, KMBeebe, DABenbow, JWBoyer, DADoran, SDHui, YLiu, SMcPherson, RKNeagu, CParker, JCPiotrowski, DWSchneider, SRTreadway, JLVanVolkenberg, MAZembrowski, WJ 1-((3S,4S)-4-amino-1-(4-substituted-1,3,5-triazin-2-yl) pyrrolidin-3-yl)-5,5-difluoropiperidin-2-one inhibitors of DPP-4 for the treatment of type 2 diabetes. Bioorg Med Chem Lett21:1810-4 (2011) 
 
Dipeptidyl peptidase 4
Name:Dipeptidyl peptidase 4
Type:Enzyme
Mol. Mass.:88271.01
Organism:Homo sapiens (Human)
Description:P27487
Residue:766
BDBM50338510
NameBDBM50338510
Synonyms:6-((3R,4S)-3-amino-4-phenylpyrrolidin-1-yl)-N-cyclopropylpyrimidin-4-amine | CHEMBL1683563
TypeSmall organic molecule
Emp. Form.C17H21N5
Mol. Mass.295.3821
SMILESN[C@H]1CN(C[C@@H]1c1ccccc1)c1cc(NC2CC2)ncn1