Reaction Details
TargetDipeptidyl peptidase 4
LigandBDBM50338511
Substrate/Competitorn/a
Meas. Tech.ChEMBL_728457 (CHEMBL1685334)
IC50 1400±n/a nM
Citation Andrews, KMBeebe, DABenbow, JWBoyer, DADoran, SDHui, YLiu, SMcPherson, RKNeagu, CParker, JCPiotrowski, DWSchneider, SRTreadway, JLVanVolkenberg, MAZembrowski, WJ 1-((3S,4S)-4-amino-1-(4-substituted-1,3,5-triazin-2-yl) pyrrolidin-3-yl)-5,5-difluoropiperidin-2-one inhibitors of DPP-4 for the treatment of type 2 diabetes. Bioorg Med Chem Lett21:1810-4 (2011) 
 
Dipeptidyl peptidase 4
Name:Dipeptidyl peptidase 4
Type:Enzyme
Mol. Mass.:88271.01
Organism:Homo sapiens (Human)
Description:P27487
Residue:766
BDBM50338511
NameBDBM50338511
Synonyms:(3'S,4'S)-4'-amino-1'-(6-(cyclopropylamino)pyrimidin-4-yl)-1,3'-bipyrrolidin-2-one | CHEMBL1683564
TypeSmall organic molecule
Emp. Form.C15H22N6O
Mol. Mass.302.3748
SMILESN[C@H]1CN(C[C@@H]1N1CCCC1=O)c1cc(NC2CC2)ncn1