Reaction Details
TargetDipeptidyl peptidase 2
LigandBDBM50338514
Substrate/Competitorn/a
Meas. Tech.ChEMBL_728474 (CHEMBL1685351)
IC50>30000±n/a nM
Citation Andrews, KMBeebe, DABenbow, JWBoyer, DADoran, SDHui, YLiu, SMcPherson, RKNeagu, CParker, JCPiotrowski, DWSchneider, SRTreadway, JLVanVolkenberg, MAZembrowski, WJ 1-((3S,4S)-4-amino-1-(4-substituted-1,3,5-triazin-2-yl) pyrrolidin-3-yl)-5,5-difluoropiperidin-2-one inhibitors of DPP-4 for the treatment of type 2 diabetes. Bioorg Med Chem Lett21:1810-4 (2011) 
 
Dipeptidyl peptidase 2
Name:Dipeptidyl peptidase 2
Type:Protein
Mol. Mass.:54339.29
Organism:Homo sapiens (Human)
Description:Q9UHL4
Residue:492
BDBM50338514
NameBDBM50338514
Synonyms:1-((3S,4S)-4-amino-1-(4-phenyl-1,3,5-triazin-2-yl)pyrrolidin-3-yl)piperidin-2-one | CHEMBL1683567
TypeSmall organic molecule
Emp. Form.C18H22N6O
Mol. Mass.338.4069
SMILESN[C@H]1CN(C[C@@H]1N1CCCCC1=O)c1ncnc(n1)-c1ccccc1