Reaction Details
TargetCoagulation factor X
LigandBDBM50338678
Substrate/Competitorn/a
Meas. Tech.ChEMBL_726871 (CHEMBL1686577)
Ki 2±n/a nM
Citation Young, RJAdams, CBlows, MBrown, DBurns-Kurtis, CLChan, CChaudry, LConvery, MADavies, DEExall, AMFoster, GHarling, JDHortense, EIrvine, SIrving, WRJackson, SKleanthous, SPateman, AJPatikis, ANRoethka, TJSenger, SStelman, GJToomey, JRWest, RIWhittaker, CZhou, PWatson, NS Structure and property based design of factor Xa inhibitors: pyrrolidin-2-ones with aminoindane and phenylpyrrolidine P4 motifs. Bioorg Med Chem Lett21:1582-7 (2011) 
 
Coagulation factor X
Name:Coagulation factor X
Type:Enzyme
Mol. Mass.:54726.60
Organism:Homo sapiens (Human)
Description:n/a
Residue:488
BDBM50338678
NameBDBM50338678
Synonyms:6-CHLORO-N-((3S)-2-OXO-1-{4-[(2R)-2--PYRROLIDINYL] PHENYL}-3-PYRROLIDINYL)-2-NAPHTHALENESULFONAMIDE CHEMBL1614819
TypeSmall organic molecule
Emp. Form.C24H23ClFN3O3S
Mol. Mass.487.974
SMILESFc1cc(ccc1N1CC[C@H](NS(=O)(=O)c2ccc3cc(Cl)ccc3c2)C1=O)[C@H]1CCCN1