Reaction Details
TargetCoagulation factor X
LigandBDBM50306134
Substrate/Competitorn/a
Meas. Tech.ChEMBL_726871 (CHEMBL1686577)
Ki 2±n/a nM
Citation Young, RJAdams, CBlows, MBrown, DBurns-Kurtis, CLChan, CChaudry, LConvery, MADavies, DEExall, AMFoster, GHarling, JDHortense, EIrvine, SIrving, WRJackson, SKleanthous, SPateman, AJPatikis, ANRoethka, TJSenger, SStelman, GJToomey, JRWest, RIWhittaker, CZhou, PWatson, NS Structure and property based design of factor Xa inhibitors: pyrrolidin-2-ones with aminoindane and phenylpyrrolidine P4 motifs. Bioorg Med Chem Lett21:1582-7 (2011) 
 
Coagulation factor X
Name:Coagulation factor X
Type:Enzyme
Mol. Mass.:54726.60
Organism:Homo sapiens (Human)
Description:n/a
Residue:488
BDBM50306134
NameBDBM50306134
Synonyms:6-chloro-N-((S)-1-(2-fluoro-4-((S)-1-(methylamino)ethyl)phenyl)-2-oxopyrrolidin-3-yl)naphthalene-2-sulfonamide | CHEMBL605294
TypeSmall organic molecule
Emp. Form.C23H23ClFN3O3S
Mol. Mass.475.963
SMILESCN[C@@H](C)c1ccc(N2CC[C@H](NS(=O)(=O)c3ccc4cc(Cl)ccc4c3)C2=O)c(F)c1