Reaction Details
TargetProgesterone receptor
LigandBDBM50338693
Substrate/Competitorn/a
Meas. Tech.ChEMBL_726893 (CHEMBL1686599)
IC50 130±n/a nM
Citation Nagata, NMiyakawa, MAmano, SFuruya, KYamamoto, NInoguchi, K Design and synthesis of tricyclic tetrahydroquinolines as a new series of nonsteroidal selective androgen receptor modulators (SARMs). Bioorg Med Chem Lett21:1744-7 (2011) 
 
Progesterone receptor
Name:Progesterone receptor
Type:PROTEIN
Mol. Mass.:98665.51
Organism:Oryctolagus cuniculus
Description:ChEMBL_775980
Residue:930
BDBM50338693
NameBDBM50338693
Synonyms:2-methyl-2-((3aR,4S,9bS)-8-nitro-3a,4,5,9b-tetrahydro-3H-cyclopenta[c]quinolin-4-yl)propan-1-ol | CHEMBL1684194
TypeSmall organic molecule
Emp. Form.C16H20N2O3
Mol. Mass.288.3416
SMILESCC(C)(CO)[C@H]1Nc2ccc(cc2[C@H]2C=CC[C@@H]12)[N+]([O-])=O