Reaction Details
TargetRho-associated protein kinase 2
LigandBDBM50026332
Substrate/Competitorn/a
Meas. Tech.ChEMBL_726899 (CHEMBL1686688)
IC50<1±n/a nM
Citation Fang, XChen, YTSessions, EHChowdhury, SVojkovsky, TYin, YPocas, JRGrant, WSchröter, TLin, LRuiz, CCameron, MDLoGrasso, PBannister, TDFeng, Y Synthesis and biological evaluation of 4-quinazolinones as Rho kinase inhibitors. Bioorg Med Chem Lett21:1844-8 (2011) 
 
Rho-associated protein kinase 2
Name:Rho-associated protein kinase 2
Type:Protein
Mol. Mass.:160885.43
Organism:Homo sapiens (Human)
Description:O75116
Residue:1388
BDBM50026332
NameBDBM50026332
Synonyms:CHEMBL1684209
TypeSmall organic molecule
Emp. Form.C28H24N6O3
Mol. Mass.492.5286
SMILESO=C(NCCc1ccccn1)c1ccc2OCC(Cc2c1)c1nc2ccc(cc2c(=O)[nH]1)-c1cn[nH]c1