Reaction Details
TargetRho-associated protein kinase 2
LigandBDBM50338721
Substrate/Competitorn/a
Meas. Tech.ChEMBL_726899 (CHEMBL1686688)
IC50 2±n/a nM
Citation Fang, XChen, YTSessions, EHChowdhury, SVojkovsky, TYin, YPocas, JRGrant, WSchröter, TLin, LRuiz, CCameron, MDLoGrasso, PBannister, TDFeng, Y Synthesis and biological evaluation of 4-quinazolinones as Rho kinase inhibitors. Bioorg Med Chem Lett21:1844-8 (2011) 
 
Rho-associated protein kinase 2
Name:Rho-associated protein kinase 2
Type:Protein
Mol. Mass.:160885.43
Organism:Homo sapiens (Human)
Description:O75116
Residue:1388
BDBM50338721
NameBDBM50338721
Synonyms:2-(2,3-dihydrobenzo[b][1,4]dioxin-2-yl)-8-methoxy-6-(1H-pyrazol-4-yl)quinazolin-4(3H)-one | CHEMBL1684228
TypeSmall organic molecule
Emp. Form.C20H16N4O4
Mol. Mass.376.3654
SMILESCOc1cc(cc2c1nc([nH]c2=O)C1COc2ccccc2O1)-c1cn[nH]c1