Reaction Details
TargetRho-associated protein kinase 2
LigandBDBM50026347
Substrate/Competitorn/a
Meas. Tech.ChEMBL_726899 (CHEMBL1686688)
IC50<1±n/a nM
Citation Fang, XChen, YTSessions, EHChowdhury, SVojkovsky, TYin, YPocas, JRGrant, WSchröter, TLin, LRuiz, CCameron, MDLoGrasso, PBannister, TDFeng, Y Synthesis and biological evaluation of 4-quinazolinones as Rho kinase inhibitors. Bioorg Med Chem Lett21:1844-8 (2011) 
 
Rho-associated protein kinase 2
Name:Rho-associated protein kinase 2
Type:Protein
Mol. Mass.:160885.43
Organism:Homo sapiens (Human)
Description:O75116
Residue:1388
BDBM50026347
NameBDBM50026347
Synonyms:CHEMBL1684197
TypeSmall organic molecule
Emp. Form.C20H16N4O2
Mol. Mass.344.3666
SMILESO=c1[nH]c(nc2ccc(cc12)-c1cn[nH]c1)C1COc2ccccc2C1