Reaction Details
TargetGlucocorticoid receptor
LigandBDBM50338735
Substrate/Competitorn/a
Meas. Tech.ChEMBL_726913 (CHEMBL1686702)
Ki 7.8±n/a nM
Citation Roach, SLHiguchi, RIHudson, ARVassar, AGrant, VHLamer, RHooper, CRungta, DSyka, PMMais, DEMarschke, KBZhi, L Tetrahydroquinolin-3-yl carbamate glucocorticoid receptor agonists with reduced PEPCK activation. Bioorg Med Chem Lett21:1658-62 (2011) 
 
Glucocorticoid receptor
Name:Glucocorticoid receptor
Type:Enzyme
Mol. Mass.:85656.87
Organism:Homo sapiens (Human)
Description:P04150
Residue:777
BDBM50338735
NameBDBM50338735
Synonyms:(+/-)-(3R,4S)-6-(3-chloro-1H-indol-7-yl)-5,7-difluoro-2,2,4-trimethyl-1,2,3,4-tetrahydroquinolin-3-yl isopropylcarbamate | CHEMBL1684343
TypeSmall organic molecule
Emp. Form.C24H26ClF2N3O2
Mol. Mass.461.932
SMILESCC(C)NC(=O)O[C@@H]1[C@@H](C)c2c(NC1(C)C)cc(F)c(c2F)-c1cccc2c(Cl)c[nH]c12