Reaction Details
TargetGlucocorticoid receptor
LigandBDBM50338736
Substrate/Competitorn/a
Meas. Tech.ChEMBL_726913 (CHEMBL1686702)
Ki 4.3±n/a nM
Citation Roach, SLHiguchi, RIHudson, ARVassar, AGrant, VHLamer, RHooper, CRungta, DSyka, PMMais, DEMarschke, KBZhi, L Tetrahydroquinolin-3-yl carbamate glucocorticoid receptor agonists with reduced PEPCK activation. Bioorg Med Chem Lett21:1658-62 (2011) 
 
Glucocorticoid receptor
Name:Glucocorticoid receptor
Type:Enzyme
Mol. Mass.:85656.87
Organism:Homo sapiens (Human)
Description:P04150
Residue:777
BDBM50338736
NameBDBM50338736
Synonyms:(+/-)-(3R,4S)-6-(3-chloro-1H-indol-7-yl)-5,7-difluoro-2,2,4-trimethyl-1,2,3,4-tetrahydroquinolin-3-yl cyclohexylcarbamate | CHEMBL1684344
TypeSmall organic molecule
Emp. Form.C27H30ClF2N3O2
Mol. Mass.501.996
SMILESC[C@@H]1[C@@H](OC(=O)NC2CCCCC2)C(C)(C)Nc2cc(F)c(c(F)c12)-c1cccc2c(Cl)c[nH]c12