Reaction Details
TargetGlucocorticoid receptor
LigandBDBM50338324
Substrate/Competitorn/a
Meas. Tech.ChEMBL_726913 (CHEMBL1686702)
Ki 2.5±n/a nM
Citation Roach, SLHiguchi, RIHudson, ARVassar, AGrant, VHLamer, RHooper, CRungta, DSyka, PMMais, DEMarschke, KBZhi, L Tetrahydroquinolin-3-yl carbamate glucocorticoid receptor agonists with reduced PEPCK activation. Bioorg Med Chem Lett21:1658-62 (2011) 
 
Glucocorticoid receptor
Name:Glucocorticoid receptor
Type:Enzyme
Mol. Mass.:85656.87
Organism:Homo sapiens (Human)
Description:P04150
Residue:777
BDBM50338324
NameBDBM50338324
Synonyms:(+/-)-(3R,4S)-5,7-difluoro-6-(1H-indol-7-yl)-2,2,4-trimethyl-1,2,3,4-tetrahydroquinolin-3-ol | CHEMBL1682441
TypeSmall organic molecule
Emp. Form.C20H20F2N2O
Mol. Mass.342.3824
SMILESC[C@@H]1[C@@H](O)C(C)(C)Nc2cc(F)c(c(F)c12)-c1cccc2cc[nH]c12