Reaction Details
TargetB-cell receptor CD22
LigandBDBM50274303
Substrate/Competitorn/a
Meas. Tech.ChEMBL_727026 (CHEMBL1686886)
IC50 530±n/a nM
Citation Abdu-Allah, HHWatanabe, KCompleto, GCSadagopan, MHayashizaki, KTakaku, CTamanaka, TTakematsu, HKozutsumi, YPaulson, JCTsubata, TAndo, HIshida, HKiso, M CD22-antagonists with nanomolar potency: the synergistic effect of hydrophobic groups at C-2 and C-9 of sialic acid scaffold. Bioorg Med Chem19:1966-71 (2011) 
 
B-cell receptor CD22
Name:B-cell receptor CD22
Type:PROTEIN
Mol. Mass.:95348.60
Organism:Homo sapiens (Human)
Description:ChEMBL_727026
Residue:847
BDBM50274303
NameBDBM50274303
Synonyms:CHEMBL502862 | p-Methoxyphenyl (3,5,9-trideoxy-5-glycolamido-9-(4-hydroxy-4-biphenyl)-methylamino-D-glycero-alpha-D-galacto-2-nonulopyranosylonicacid)-(2->6)-beta-D-galactopyranoside
TypeSmall organic molecule
Emp. Form.C37H46N2O16
Mol. Mass.774.7649
SMILESCOc1ccc(O[C@@H]2O[C@H](CO[C@@]3(C[C@H](O)[C@@H](NC(=O)CO)[C@@H](O3)[C@H](O)[C@H](O)CNCc3ccc(cc3)-c3ccc(O)cc3)C(O)=O)[C@H](O)[C@H](O)[C@H]2O)cc1