Reaction Details
TargetC-C chemokine receptor type 5
LigandBDBM50339029
Substrate/Competitorn/a
Meas. Tech.ChEMBL_729858 (CHEMBL1697612)
IC50 3.90±n/a nM
Citation Xue, CBChen, LCao, GZhang, KWang, AMeloni, DGlenn, JAnand, RXia, MKong, LHuang, TFeng, HZheng, CLi, MGalya, LZhou, JShin, NBaribaud, FSolomon, KScherle, PZhao, BDiamond, SEmm, TKeller, DContel, NYeleswaram, SVaddi, KHollis, GNewton, RFriedman, SMetcalf, B. Discovery of INCB9471, a Potent, Selective, and Orally Bioavailable CCR5 Antagonist with Potent Anti-HIV-1 Activity. ACS Med Chem Lett1:483-487 (2010) 
 
C-C chemokine receptor type 5
Name:C-C chemokine receptor type 5
Type:Enzyme
Mol. Mass.:40540.21
Organism:Homo sapiens (Human)
Description:P51681
Residue:352
BDBM50339029
NameBDBM50339029
Synonyms:5-({4-[(3S)-4-(5-Bromo-2,3-dihydro-1H-inden-1-yl)-3-methylpiperazin-1-yl]-4-methylpiperidin-1-yl}carbonyl)-4,6-dimethylpyrimidine | CHEMBL1688239
TypeSmall organic molecule
Emp. Form.C27H36BrN5O
Mol. Mass.526.512
SMILESC[C@H]1CN(CCN1C1CCc2cc(Br)ccc12)C1(C)CCN(CC1)C(=O)c1c(C)ncnc1C